[dev] debian, again

From: Davide Anchisi <danchisi_AT_gmail.com>
Date: Fri, 6 Nov 2009 11:58:45 +0100


after some weeks off, I come back to try to get a .deb package from
wmii sources (hg2585) using the command 'make deb'.
In the meanwhile I moved from ubuntu to debian squeeze.

Things go on pretty well, but then I got these error messages:

cc: ../lib/libregexp9.a: No such file or directory
cc: ../lib/libbio.a: No such file or directory
cc: ../lib/libfmt.a: No such file or directory
cc: ../lib/libutf.a: No such file or directory

The strange thing is that those file are there.

Any idea?

Here below the whole output from make deb.



dpkg-buildpackage: set CFLAGS to default value: -g -O2
dpkg-buildpackage: set CPPFLAGS to default value:
dpkg-buildpackage: set LDFLAGS to default value:
dpkg-buildpackage: set FFLAGS to default value: -g -O2
dpkg-buildpackage: set CXXFLAGS to default value: -g -O2
dpkg-buildpackage: source package wmii-hg
dpkg-buildpackage: source version hg2585
dpkg-buildpackage: source changed by Kris Maglione <kris_AT_suckless.org>
dpkg-buildpackage: host architecture amd64
 debian/rules build
dh: Unknown sequence .depend (choose from: binary binary-arch
binary-indep build clean install)
MAKE all libbio/
CC libbio/bbuffered.o
CC libbio/bfildes.o
CC libbio/bflush.o
CC libbio/bgetc.o
CC libbio/bgetd.o
CC libbio/bgetrune.o
CC libbio/binit.o
CC libbio/boffset.o
CC libbio/bprint.o
CC libbio/bvprint.o
CC libbio/bputc.o
CC libbio/bputrune.o
CC libbio/brdline.o
CC libbio/brdstr.o
CC libbio/bread.o
CC libbio/bseek.o
CC libbio/bwrite.o
AR lib/libbio.a
MAKE all libfmt/
CC libfmt/dofmt.o
CC libfmt/dorfmt.o
CC libfmt/errfmt.o
CC libfmt/fltfmt.o
CC libfmt/fmt.o
CC libfmt/fmtfd.o
CC libfmt/fmtfdflush.o
CC libfmt/fmtlock.o
CC libfmt/fmtprint.o
CC libfmt/fmtquote.o
CC libfmt/fmtrune.o
CC libfmt/fmtstr.o
CC libfmt/fmtvprint.o
CC libfmt/fprint.o
CC libfmt/print.o
CC libfmt/runefmtstr.o
CC libfmt/runeseprint.o
CC libfmt/runesmprint.o
CC libfmt/runesnprint.o
CC libfmt/runesprint.o
CC libfmt/runevseprint.o
CC libfmt/runevsmprint.o
CC libfmt/runevsnprint.o
CC libfmt/seprint.o
CC libfmt/smprint.o
CC libfmt/snprint.o
CC libfmt/sprint.o
CC libfmt/strtod.o
CC libfmt/vfprint.o
CC libfmt/vseprint.o
CC libfmt/vsmprint.o
CC libfmt/vsnprint.o
CC libfmt/charstod.o
CC libfmt/pow10.o
CC libfmt/nan64.o
AR lib/libfmt.a
MAKE all libregexp/
CC libregexp/regcomp.o
CC libregexp/regerror.o
CC libregexp/regexec.o
CC libregexp/regsub.o
CC libregexp/regaux.o
CC libregexp/rregexec.o
CC libregexp/rregsub.o
AR lib/libregexp9.a
MAKE all libutf/
CC libutf/rune.o
CC libutf/runestrcat.o
CC libutf/runestrchr.o
CC libutf/runestrcmp.o
CC libutf/runestrcpy.o
CC libutf/runestrdup.o
CC libutf/runestrlen.o
CC libutf/runestrecpy.o
CC libutf/runestrncat.o
CC libutf/runestrncmp.o
CC libutf/runestrncpy.o
CC libutf/runestrrchr.o
CC libutf/runestrstr.o
CC libutf/runetype.o
CC libutf/utfecpy.o
CC libutf/utflen.o
CC libutf/utfnlen.o
CC libutf/utfrrune.o
CC libutf/utfrune.o
CC libutf/utfutf.o
AR lib/libutf.a
MAKE all doc/
MAKE all man/
MAKE all cmd/
CC cmd/util.o
FILTER cmd/wihack.sh
FILTER cmd/wmii.rc.rc
FILTER cmd/wmii.sh.sh
CC cmd/wmii9menu.o
CC cmd/clientutil.o
MAKE all cmd/wmii/
CC cmd/wmii/area.o
CC cmd/wmii/bar.o
CC cmd/wmii/client.o
CC cmd/wmii/column.o
CC cmd/wmii/div.o
CC cmd/wmii/event.o
CC cmd/wmii/ewmh.o
CC cmd/wmii/float.o
CC cmd/wmii/frame.o
CC cmd/wmii/fs.o
CC cmd/wmii/geom.o
CC cmd/wmii/key.o
CC cmd/wmii/layout.o
CC cmd/wmii/main.o
CC cmd/wmii/map.o
CC cmd/wmii/message.o
CC cmd/wmii/mouse.o
CC cmd/wmii/print.o
CC cmd/wmii/root.o
CC cmd/wmii/rule.o
CC cmd/wmii/printevent.o
CC cmd/wmii/screen.o
CC cmd/wmii/utf.o
CC cmd/wmii/_util.o
CC cmd/wmii/view.o
CC cmd/wmii/xdnd.o
CC cmd/wmii/x11.o
CC cmd/wmii/xext.o
LD cmd/wmii/wmii.out
cc: ../lib/libregexp9.a: No such file or directory
cc: ../lib/libbio.a: No such file or directory
cc: ../lib/libfmt.a: No such file or directory
cc: ../lib/libutf.a: No such file or directory
make[4]: *** [wmii.out] Error 1
make[3]: *** [dall] Error 2
make[2]: *** [dall] Error 2
dh_auto_build: make returned exit code 2
make[1]: *** [build] Error 1
dpkg-buildpackage: error: debian/rules build gave error exit status 2
make: *** [deb] Error 2
Received on Fri Nov 06 2009 - 10:58:45 UTC

This archive was generated by hypermail 2.2.0 : Fri Nov 06 2009 - 11:00:02 UTC